{"text_format":"1","workbook":"xlsx","n_sheets":7,"sheets":["LEA Name List","Guidance","Budget Overview","AR APP Budget Sheet","Funding Sources","Carryover","Allocation"],"not_rendered":{"charts":0,"images":0,"macros":1,"external_links":4,"defined_names":20,"comments":0,"pivot_tables":0},"unopened":[],"bounds":{"document_bytes":16777216,"sheet_cells":100000,"rows_first":2000,"rows_last":500,"rows_between":2000,"halvings":0,"cell_chars":16384,"cell_head_chars":4096},"cells_cut":0,"cells_raw":0,"read":"whole","date_system":"1900"}

{"sheet":"LEA Name List","index":0,"n_rows":264,"n_cols":1,"rows_kept":264,"cut":false,"hidden":true,"merged":[]}
[]
[]
["Sample District - 9999"]
["Academics Plus Public Charter Schools - 6040"]
["Academies of Math and Science - 6065"]
["Alma - 1701"]
["Alpena - 0501"]
["Arkadelphia - 1002"]
["Arkansas Arts Academy - 0440"]
["Arkansas Connections Academy - 0444"]
["Arkansas Lighthouse Academies - 6050"]
["Arkansas School for the Blind - 6091"]
["Arkansas School for the Deaf - 6092"]
["Arkansas Virtual Academy - 6043"]
["Armorel - 4701"]
["Ashdown - 4101"]
["Atkins - 5801"]
["Augusta - 7401"]
["Bald Knob - 7301"]
["Barton - 5401"]
["Batesville - 3201"]
["Bauxite - 6301"]
["Bay - 1601"]
["Bearden - 5201"]
["Beebe - 7302"]
["Benton - 6302"]
["Bentonville - 0401"]
["Bergman - 0502"]
["Berryville - 0801"]
["Bismarck - 3001"]
{"$rows_left_out":235}
{"sheet":"Guidance","index":1,"n_rows":12,"n_cols":1,"rows_kept":12,"cut":false,"hidden":false,"merged":[[7,0,7,18],[11,0,11,2],[9,0,9,2],[10,0,10,2],[1,0,1,18],[4,0,4,18],[5,0,5,18],[6,0,6,18]]}
["Purpose:"]
["The AR App guides districts in creating a district wide Strategic Plan to support student learning outcomes. Once districts identify their priorities in the AR App, Superintendents, along with their AR App Team, must determine how to implement those priorities. The most direct way is to focus on how the district develops their budget. This tool is designed to guide Superintendents and their AR App Teams in budgeting thier federal and state funding sources to support the district's Strategic Plan."]
[]
["How to use this tool:"]
["Step 1: Superintendents and their AR App Team review their district's AR App to determine what expenditures are needed to support the district's Strategic Plan developed through the Ar App."]
["Step 2: Federal/State program coordinators identify possible expenditures that support the implementation of the district's Strategic Plan developed through the AR App."]
["Step 3: If needed Federal/State program coordinators propose what the district could consider not funding in order to meet the requirements of the AR App developed Strategic Plan."]
["Step 4: Superintendents develop a budget from the available options and funding sources that support the Strategic Plan developed through the Ar App."]
[]
["Resources:"]
["AR APP Website"]
["Student Special Needs Funding Rules"]

{"sheet":"Budget Overview","index":2,"n_rows":26,"n_cols":5,"rows_kept":26,"cut":false,"hidden":false,"merged":[[1,0,1,2]]}
[]
["Sample District - 9999"]
[{"$f":"RIGHT(A2,4)","v":"9999"}]
["Fund Source","Previous Year Carryover","Current Year Allocation","Total Budgeted","Difference\n (Amount Not Budgeted)\n(Amount Over Budgeted)"]
["ABC- 2365",{"$f":"VLOOKUP($A$3,Carryover!$A$2:$W$264,7,FALSE)","v":0},{"$f":"VLOOKUP($A$3,Allocation!$A$2:$W$264,7,FALSE)","v":0},{"$f":"SUMIF('AR APP Budget Sheet'!$E:$E,'Budget Overview'!A5,'AR APP Budget Sheet'!$C:$C)","v":0},{"$f":"B5+C5-D5","v":0}]
["ALE- 2275",{"$f":"VLOOKUP($A$3,Carryover!$A$2:$W$264,3,FALSE)","v":5665.78},{"$f":"VLOOKUP($A$3,Allocation!$A$2:$W$264,3,FALSE)","v":39351},{"$f":"SUMIF('AR APP Budget Sheet'!$E:$E,'Budget Overview'!A6,'AR APP Budget Sheet'!$C:$C)","v":0},{"$f":"B6+C6-D6","v":45016.78}]
["ELL- 2276",{"$f":"VLOOKUP($A$3,Carryover!$A$2:$W$264,4,FALSE)","v":11908.99},{"$f":"VLOOKUP($A$3,Allocation!$A$2:$W$264,4,FALSE)","v":80886},{"$f":"SUMIF('AR APP Budget Sheet'!$E:$E,'Budget Overview'!A7,'AR APP Budget Sheet'!$C:$C)","v":0},92794.99]
["ESA- 2281",{"$f":"VLOOKUP($A$3,Carryover!$A$2:$W$264,5,FALSE)","v":42761.41},{"$f":"VLOOKUP($A$3,Allocation!$A$2:$W$264,5,FALSE)","v":485276},{"$f":"SUMIF('AR APP Budget Sheet'!$E:$E,'Budget Overview'!A8,'AR APP Budget Sheet'!$C:$C)","v":0},528037.41]
["PD- 2223",{"$f":"VLOOKUP($A$3,Carryover!$A$2:$W$264,6,FALSE)","v":0},{"$f":"VLOOKUP($A$3,Allocation!$A$2:$W$264,6,FALSE)","v":21190},{"$f":"SUMIF('AR APP Budget Sheet'!$E:$E,'Budget Overview'!A9,'AR APP Budget Sheet'!$C:$C)","v":0},21190]
["Title I-A 6501",{"$f":"VLOOKUP($A$3,Carryover!$A$2:$W$264,16,FALSE)","v":20803.91},{"$f":"VLOOKUP($A$3,Allocation!$A$2:$W$264,16,FALSE)","v":139236.78},{"$f":"SUMIF('AR APP Budget Sheet'!$E:$E,'Budget Overview'!A10,'AR APP Budget Sheet'!$C:$C)","v":0},160040.69]
["Title I-C 6502",{"$f":"VLOOKUP($A$3,Carryover!$A$2:$W$264,17,FALSE)","v":0},{"$f":"VLOOKUP($A$3,Allocation!$A$2:$W$264,17,FALSE)","v":0},{"$f":"SUMIF('AR APP Budget Sheet'!$E:$E,'Budget Overview'!A11,'AR APP Budget Sheet'!$C:$C)","v":0},0]
["Title I-D 6510",{"$f":"VLOOKUP($A$3,Carryover!$A$2:$W$264,18,FALSE)","v":0},{"$f":"VLOOKUP($A$3,Allocation!$A$2:$W$264,18,FALSE)","v":0},{"$f":"SUMIF('AR APP Budget Sheet'!$E:$E,'Budget Overview'!A12,'AR APP Budget Sheet'!$C:$C)","v":0},0]
["Title II- 6756",{"$f":"VLOOKUP($A$3,Carryover!$A$2:$W$264,19,FALSE)","v":4518.9799999999996},{"$f":"VLOOKUP($A$3,Allocation!$A$2:$W$264,19,FALSE)","v":27611.89},{"$f":"SUMIF('AR APP Budget Sheet'!$E:$E,'Budget Overview'!A13,'AR APP Budget Sheet'!$C:$C)","v":0},32130.87]
["Title III-ESOL- 6761",{"$f":"VLOOKUP($A$3,Carryover!$A$2:$W$264,20,FALSE)","v":11657.27},{"$f":"VLOOKUP($A$3,Allocation!$A$2:$W$264,20,FALSE)","v":23604.54},{"$f":"SUMIF('AR APP Budget Sheet'!$E:$E,'Budget Overview'!A14,'AR APP Budget Sheet'!$C:$C)","v":0},35261.81]
["Title IV- 6786",{"$f":"VLOOKUP($A$3,Carryover!$A$2:$W$264,21,FALSE)","v":4250.38},{"$f":"VLOOKUP($A$3,Allocation!$A$2:$W$264,21,FALSE)","v":10784.57},{"$f":"SUMIF('AR APP Budget Sheet'!$E:$E,'Budget Overview'!A15,'AR APP Budget Sheet'!$C:$C)","v":0},15034.95]
["Title V- 6784",{"$f":"VLOOKUP($A$3,Carryover!$A$2:$W$264,22,FALSE)","v":0},{"$f":"VLOOKUP($A$3,Allocation!$A$2:$W$264,22,FALSE)","v":0},{"$f":"SUMIF('AR APP Budget Sheet'!$E:$E,'Budget Overview'!A16,'AR APP Budget Sheet'!$C:$C)","v":0},0]
["Medicaid - 6750",{"$f":"VLOOKUP($A$3,Carryover!$A$2:$W$264,8,FALSE)","v":0},{"$f":"VLOOKUP($A$3,Allocation!$A$2:$W$264,8,FALSE)","v":0},{"$f":"SUMIF('AR APP Budget Sheet'!$E:$E,'Budget Overview'!A17,'AR APP Budget Sheet'!$C:$C)","v":0},0]
["ARMAC- 6752",{"$f":"VLOOKUP($A$3,Carryover!$A$2:$W$264,9,FALSE)","v":0},{"$f":"VLOOKUP($A$3,Allocation!$A$2:$W$264,9,FALSE)","v":0},{"$f":"SUMIF('AR APP Budget Sheet'!$E:$E,'Budget Overview'!A18,'AR APP Budget Sheet'!$C:$C)","v":0},{"$f":"B18+C18-D18","v":0}]
["State EIDT Budget - 2262",{"$f":"VLOOKUP($A$3,Carryover!$A$2:'Carryover'!W$264,10,FALSE)","v":0},{"$f":"VLOOKUP($A$3,Allocation!$A$2:$W$264,10,FALSE)","v":6266.78},{"$f":"SUMIF('AR APP Budget Sheet'!$E:$E,'Budget Overview'!A19,'AR APP Budget Sheet'!$C:$C)","v":0},6266.78]
["State EC SPED Budget - 2260",{"$f":"VLOOKUP($A$3,Carryover!$A$2:$W$264,15,FALSE)","v":0},{"$f":"VLOOKUP($A$3,Allocation!$A$2:$W$264,15,FALSE)","v":17644},{"$f":"SUMIF('AR APP Budget Sheet'!$E:$E,'Budget Overview'!A20,'AR APP Budget Sheet'!$C:$C)","v":0},17644]
["IDEA Part B (3-5) Budget - 6710",{"$f":"VLOOKUP($A$3,Carryover!$A$2:$W$264,14,FALSE)","v":28.69},{"$f":"VLOOKUP($A$3,Allocation!$A$2:$W$264,14,FALSE)","v":5729.96},{"$f":"SUMIF('AR APP Budget Sheet'!$E:$E,'Budget Overview'!A21,'AR APP Budget Sheet'!$C:$C)","v":0},5758.65]
["IDEA Part B (3-21) Budget - 6702",{"$f":"VLOOKUP($A$3,Carryover!$A$2:$W$264,23,FALSE)","v":51686.79},{"$f":"VLOOKUP($A$3,Allocation!$A$2:$W$264,23,FALSE)","v":164607.6},{"$f":"SUMIF('AR APP Budget Sheet'!$E:$E,'Budget Overview'!A22,'AR APP Budget Sheet'!$C:$C)","v":0},216294.39]
["GT Required Expenditure",{"$f":"VLOOKUP($A$3,Carryover!$A$2:$W$264,12,FALSE)","v":0},{"$f":"VLOOKUP($A$3,Allocation!$A$2:$W$264,12,FALSE)","v":32933.11},{"$f":"SUMIF('AR APP Budget Sheet'!$E:$E,'Budget Overview'!A23,'AR APP Budget Sheet'!$C:$C)","v":0},32933.11]
["Grant",null,null,{"$f":"SUMIF('AR APP Budget Sheet'!$E:$E,'Budget Overview'!A24,'AR APP Budget Sheet'!$C:$C)","v":0},0]
["Operating",null,null,{"$f":"SUMIF('AR APP Budget Sheet'!$E:$E,'Budget Overview'!A25,'AR APP Budget Sheet'!$C:$C)","v":0},0]
["Other",null,null,{"$f":"SUMIF('AR APP Budget Sheet'!$E:$E,'Budget Overview'!A26,'AR APP Budget Sheet'!$C:$C)","v":0},0]

{"sheet":"AR APP Budget Sheet","index":3,"n_rows":242,"n_cols":10,"rows_kept":242,"cut":false,"hidden":false,"merged":[[107,0,113,0],[53,0,60,0],[63,0,69,0],[99,0,104,0],[72,0,78,0],[81,0,87,0],[90,0,96,0],[3,0,4,7],[43,0,50,0],[6,0,12,0],[15,0,22,0],[25,0,31,0],[34,0,40,0],[116,0,117,7],[234,0,240,0],[119,0,125,0],[128,0,134,0],[214,0,220,0],[223,0,229,0],[167,0,173,0],[176,0,182,0],[185,0,191,0],[194,0,195,7],[197,0,202,0],[205,0,211,0],[137,0,143,0],[155,0,161,0],[164,0,165,7],[146,0,152,0]]}
[{"$f":"'Budget Overview'!A2","v":"Sample District - 9999"}]
[]
[null,"Step 1: Proposed Purchase","Estimated Cost","Is this a new expenditure?","Step 2: Source of Funds","Step 3: Proposed Cut ","Step 3: Estimated Cost","Step 3: Source of Funds"]
["Improving Academic Outcomes"]
[]
["Priority 1.1"]
["Identify High Quality Instructional Materials (HQIM) for core instruction in literacy and math.",null,null,null,null,null,null,null,{"$f":"+$A$6","v":"Priority 1.1"},{"$f":"#REF!","v":{"$error":"#REF!"}}]
[]
[]
[]
[null,null,null,null,null,null,null,null,{"$f":"+$A$6","v":"Priority 1.1"},{"$f":"#REF!","v":{"$error":"#REF!"}}]
[null,null,null,null,null,null,null,null,"Priority 1.1",{"$f":"#REF!","v":{"$error":"#REF!"}}]
[null,null,null,null,null,null,null,null,"Priority 1.1",{"$f":"#REF!","v":{"$error":"#REF!"}}]
[]
["Priority 1.2"]
["Identify Professional Learning\n",null,null,null,null,null,null,null,{"$f":"$A$15","v":"Priority 1.2"},{"$f":"$A$16","v":"Identify Professional Learning\n"}]
[null,null,null,null,null,null,null,null,"Priority 1.2","Identify Professional Learning\n"]
[null,null,null,null,null,null,null,null,"Priority 1.2","Identify Professional Learning\n"]
[]
[null,null,null,null,null,null,null,null,"Priority 1.2","Identify Professional Learning\n"]
[null,null,null,null,null,null,null,null,"Priority 1.2","Identify Professional Learning\n"]
[null,null,null,null,null,null,null,null,"Priority 1.2","Identify Professional Learning\n"]
[null,null,null,null,null,null,null,null,"Priority 1.2","Identify Professional Learning\n"]
[]
["Priority 1.3"]
["Identify High Quality Supplemental Instructional Materials",null,null,null,null,null,null,null,{"$f":"$A$25","v":"Priority 1.3"},{"$f":"$A$26","v":"Identify High Quality Supplemental Instructional Materials"}]
[null,null,null,null,null,null,null,null,"Priority 1.3","Identify High Quality Supplemental Instructional Materials"]
[null,null,null,null,null,null,null,null,"Priority 1.3","Identify High Quality Supplemental Instructional Materials"]
[null,null,null,null,null,null,null,null,"Priority 1.3","Identify High Quality Supplemental Instructional Materials"]
[null,null,null,null,null,null,null,null,"Priority 1.3","Identify High Quality Supplemental Instructional Materials"]
{"$rows_left_out":213}
{"sheet":"Funding Sources","index":4,"n_rows":262,"n_cols":4,"rows_kept":262,"cut":false,"hidden":true,"merged":[[243,0,243,1],[244,0,261,0],[4,0,7,0],[8,0,19,0],[20,0,29,0],[30,0,37,0],[38,0,47,0],[48,0,53,0],[54,0,59,0],[60,0,66,0],[67,0,76,0],[77,0,84,0],[85,0,92,0],[93,0,103,0],[104,0,116,0],[126,0,133,0],[134,0,134,1],[117,0,119,0],[120,0,125,0],[241,0,242,0],[135,0,142,0],[143,0,150,0],[151,0,158,0],[159,0,166,0],[167,0,175,0],[184,0,191,0],[192,0,199,0],[230,0,230,1],[215,0,222,0],[223,0,229,0],[231,0,233,0],[234,0,237,0],[183,0,183,1],[200,0,207,0],[208,0,214,0],[238,0,240,0],[176,0,182,0]]}
[null,null,null,"Is this a new expenditure?"]
[null,null,null,"Yes"]
[null,null,null,"No"]
[]
["P1.1","ESA- 2281"]
[null,"Operating"]
[null,"Grant"]
[null,"Other"]
["P1.2","ALE- 2275"]
[null,"ELL- 2276"]
[null,"ESA- 2281"]
[null,"Grant"]
[null,"Operating"]
[null,"PD- 2223"]
[null,"Title I-A 6501"]
[null,"Title II- 6756"]
[null,"Title III-ESOL- 6761-ESOL"]
[null,"IDEA Part B (3-21) Budget - 6702"]
[null,"Title V- 6784"]
[null,"Other"]
["P1.3","ALE- 2275"]
[null,"ELL- 2276"]
[null,"ESA- 2281"]
[null,"Operating"]
[null,"Title I-A 6501"]
[null,"Title III-ESOL- 6761-ESOL"]
[null,"Title IV- 6786"]
[null,"Title V- 6784"]
[null,"IDEA Part B (3-21) Budget - 6702"]
[null,"Other"]
{"$rows_left_out":233}
{"sheet":"Carryover","index":5,"n_rows":265,"n_cols":23,"rows_kept":265,"cut":false,"hidden":true,"merged":[]}
[null,null,3,4,5,6,7,8,9,10,11,12,13,14,15,16,17,18,19,20,21,22,23]
["District LEA","District Name","ALE: 2275","ELL: 2276","ESA: 2281","PD: 2223","ABC","Medicaid: 6750","ARMAC: 6752 ","EIDT: 2262","Grant","GT Required Expenditure","Operating","Fed Early Childhood SPED: 6710","State Early Childhood SPED: 2260","Title I - A:  6501","Title I - C: 6502","Title I - D: 6510","Title II: 6756","Title III-ESOL: 6761","Title IV: 6786","Title V: 6784","IDEA Part B: 6702"]
["9999","Sample District",5665.78,11908.99,42761.41,0,null,null,null,0,null,null,null,28.69,0,20803.91,0,0,4518.9799999999996,11657.27,4250.38,null,51686.79]
["0101","DEWITT",0,0,19331.919999999998,0,null,null,null,0,null,null,null,0,0,70540.679999999993,0,0,0,6095.25,0,2615.21,113.85]
["0104","STUTTGART           ",0,0,71425.7,63684.55,null,null,null,0,null,null,null,0,0,63064.59,0,0,93997.42,0,10272.040000000001,3678.13,70422.75]
["0201","CROSSETT            ",0,0,38352.29,27924.89,null,null,null,0,null,null,null,0,0,75777.8,0,0,8115.19,0,0,3545.3100000000004,16274]
["0203","HAMBURG",0,13168.68,9314.3799999999992,35973.61,null,null,null,0,null,null,null,0,0,31251.62,13298.83,0,27024.5,2801.62,0,3551.72,70139.31]
["0302","COTTER              ",0,1732,31769.52,12652.06,null,null,null,10.38,null,null,null,3.06,29.23,150209.03,0,0,0,0,0,75.819999999999993,0]
["0303","MOUNTAIN HOME       ",0,8299.85,788.89,50982.12,null,null,null,0,null,null,null,0,0,400032.56,0,0,22670.36,0,0,null,11567.59]
["0304","NORFORK             ",0,704,0,0,null,null,null,0,null,null,null,0,0,63141.98,0,0,0,0,16290.72,null,12263.7]
["0401","BENTONVILLE",137649.84,7893.37,296799.08,50331.15,null,null,null,0,null,null,null,1280.81,0.82,230008.43,0,29654.39,266685.88,237926.36,119252.81,null,216594.88]
["0402","DECATUR             ",5665.78,11908.99,42761.41,0,null,null,null,0,null,null,null,28.69,0,20803.91,0,0,4518.9799999999996,11657.27,4250.38,null,51686.79]
["0404","GRAVETTE            ",5870.63,2598.85,115897.24,3096.17,null,null,null,10287.85,null,null,null,0,0,0,0,0,30717.14,4717.09,18561.84,null,191253.69]
["0405","ROGERS              ",0,0,27196.01,0,null,null,null,3670.92,null,null,null,2448.73,12954.22,18459.169999999998,0,0,46663.07,0,48542.96,null,75030.2]
["0406","SILOAM SPRINGS      ",0,0,615348.9,100000,null,null,null,0,null,null,null,0,0,245380,0,0,176599.09,235164.66,1635.9,null,249657.64]
["0407","PEA RIDGE           ",24929.33,66414.58,185740.82,53502.79,null,null,null,0,null,null,null,0,0,116441.61,0.34,0,34060.51,43772.13,731.86,null,0]
["0440","ARKANSAS ARTS ACADEMY",0,3500.73,31847.84,11251.31,null,null,null,0,null,null,null,0,0,59762.91,0,0,7124.65,0,18990.04,null,136510.29999999999]
["0442","FOUNDERS CLASSICAL ACADEMY",0,26838.98,28710.959999999999,29.45,null,null,null,6396.17,null,null,null,13422.24,19103.79,33097.17,0,0,1337.55,0,0,null,4085.19]
["0444","ARKANSAS CONNECTIONS ACADEMY",0,692.3,43973.83,15423.13,null,null,null,0,null,null,null,5666.02,2173.6,3968.07,0,0,0,1886.51,29459.07,null,40971.68]
["0445","HOPE ACADEMY",0,10992.86,0,42989.66,null,null,null,0,null,null,null,0,0,1007.11,0,0,0,0,0,null,0]
["0446","SCHOOL FOR ADVANCED STUDIES",98770,1127.17,0,1465.86,null,null,null,0,null,null,null,0,0,0,0,0,0,0,0,null,1941.33]
["0448","GARFIELD SCHOLARS ACADEMY",0,0,0,0,null,null,null,0,null,null,null,0,0,0,0,0,0,0,1754.27,null,0]
["0501","ALPENA              ",0,0,0,0,null,null,null,0,null,null,null,0,0,0,0,0,0,0,0,null,0]
["0502","BERGMAN             ",11988.02,11309.61,0,175.59,null,null,null,0,null,null,null,1.87,0,122561.3,0,0,3088.7,0,9733.67,null,268.19]
["0503","HARRISON            ",10593.39,484.13,22755.06,5.95,null,null,null,0,null,null,null,0,0,18874.7,0,0,2294.2800000000002,0,0,null,0]
["0504","OMAHA               ",0,0,0,0,null,null,null,0,null,null,null,0,0,5408.77,0,0,0,0,0,null,0]
["0505","VALLEY SPRINGS      ",7.6,53.41,8219.4599999999991,12109.25,null,null,null,0,null,null,null,1.61,0,31686.78,0,0,1719.5,0,0,null,327.82]
["0506","LEAD HILL           ",0,3009.78,0,66754.14,null,null,null,732.35,null,null,null,0,0,3127.72,0,0,5390.59,0,7900.46,null,0]
["0601","HERMITAGE           ",0,3991,8615.09,0,null,null,null,255.51,null,null,null,1686.37,0,8148.29,0,0,813.52,0,92.87,null,0]
["0602","WARREN              ",32663.53,0,25662.97,0,null,null,null,0,null,null,null,0,0,36865.699999999997,96170.22,0,0,0,0,null,29066.799999999999]
{"$rows_left_out":236}
{"sheet":"Allocation","index":6,"n_rows":265,"n_cols":26,"rows_kept":265,"cut":false,"hidden":true,"merged":[]}
[null,null,3,4,5,6,7,"8","9","10","11","12","13","14","15","16","17","18","19","20","21","22","23"]
["District LEA","District Name","ALE: 2275","ELL: 2276","ESA: 2281","PD: 2223","ABC","Medicaid: 6750 ","ARMAC: 6752 ","EIDT: 2262","Grant","GT Required Expenditure","Operating","Fed Early Childhood SPED: 6710","State Early Childhood SPED: 2260","Title I - A:  6501","Title I - C: 6502","Title I - D: 6510","Title II: 6756","Title III-ESOL: 6761","Title IV: 6786","Title V: 6784","Title VI B (IDEA Part B - SPED): 6702"]
["9999","SAMPLE DISTRICT",39351,80886,485276,21190,null,null,null,6266.78,null,32933.11,null,5729.96,17644,139236.78,0,0,27611.89,23604.54,10784.57,0,164607.6]
["0101","DEWITT",43991,16470,363150,41513,null,null,null,28200.53,null,64518.73,null,12250.74,79398.039999999994,376267.87,0,0,61007.77,0,28868.3,38543.65,315337.34000000003,null,null,"Final"]
["0104","STUTTGART           ",66736,39162,496036,57166,null,null,null,25067.14,null,88847.59,null,21464.85,70576.03,538490.65,0,0,85539.09,220.98,38207.760000000002,54657.39,457316.17,null,null,"Preliminary"]
["0201","CROSSETT            ",206808,12444,496036,56486,null,null,null,42524.61,null,87790.93,null,32377.23,119727.2,682743.53,0,0,100655.42,0,52399.39,53105.91,458102.08]
["0203","HAMBURG",118156,52704,551450,57720,null,null,null,42972.24,null,89708.42,null,25342.53,120987.49,462652.19999999995,104557.53,0,72079.94,15857.29,34203.01,52894.94,470886.85]
["0302","COTTER              ",34630,1098,251784,25185,null,null,null,5819.15,null,39143.11,null,8842.6,16383.72,252818.08,0,0,31301.45,0,21038.38,0,189684.31]
["0303","MOUNTAIN HOME       ",378879,12810,937196,142402,null,null,null,56848.7,null,221321.38,null,40931.550000000003,160056.37,1206042.3400000001,0,0,173504.09,0,98914.22,0,981306.69]
["0304","NORFORK             ",0,0,201040,17163,null,null,null,4923.8999999999996,null,26674.15,null,12854.69,13863.15,192915.02,0,0,26962.460000000003,0,15880.22,0,139192.47]
["0401","BENTONVILLE",903045,375882,1873316,714852,null,null,null,131602.5,null,1111023.56,null,103973.99,370524.2,1523225.27,0,17824.66,349837.3,101600.40999999999,115489.8,0,3930214.32]
["0402","DECATUR             ",39351,80886,485276,21190,null,null,null,6266.78,null,32933.11,null,5729.96,17644,139236.78,0,0,27611.89,23604.54,10784.57,0,164607.6]
["0403","GENTRY              ",146892,75396,543215,62659,null,null,null,11190.68,null,97384.23,null,10636.48,31507.15,232007.22,0,0,48682.32,22114.86,18278.43,0,426916.13]
["0404","GRAVETTE            ",127985,20130,469339,76164,null,null,null,16114.59,null,118373.51,null,12485.25,45370.31,276476.15000000002,0,0,59477.9,0,24682.06,0,448279.6]
["0405","ROGERS              ",790477,1566480,4362104,580624,null,null,null,113697.4,null,902405.43,null,106753.59,320112.74,2949080.92,0,0,490048.15,478676.06000000006,244776.98,0,3505598.28]
["0406","SILOAM SPRINGS      ",395411,361608,1407833,168515,null,null,null,42076.99,null,261905.24,null,25910.13,118466.92,963609.07,0,0,144025.51,111029.45000000001,85944.27,0,961225.71]
["0407","PEA RIDGE           ",26813,42090,454703,94382,null,null,null,12981.19,null,146687.73000000001,null,17014.07,36548.300000000003,224154.83,0,0,51510.11,0,19651.900000000001,0,514121.4]
["0440","ARKANSAS ARTS ACADEMY",0,27084,220580,37078,null,null,null,2238.13,null,57626.82,null,6280.5,6301.43,174668.24,0,0,23391.69,0,14888.27,0,206342.53]
["0442","FOUNDERS CLASSICAL ACADEMY",0,88206,91460,66113,null,null,null,2238.13,null,0,null,9703.84,6301.43,48229.9,0,0,32843.57,25899.5,10000,0,352922.23]
["0444","ARKANSAS CONNECTIONS ACADEMY",0,37698,0,143418,null,null,null,0,null,0,null,0,0,1394716.48,0,0,214563.52,0,66995.06,0,892135.62]
["0445","HOPE ACADEMY",50860,0,0,1067,null,null,null,0,null,0,null,0,0,350.62,0,0,677.29,0,10000,0,10846.82]
["0446","SCHOOL FOR ADVANCED STUDIES",0,0,0,3113,null,null,null,0,null,0,null,0,0,0,0,0,878.5,0,0,0,14957.7]
["0448","GARFIELD SCHOLARS ACADEMY",0,0,15602,3638,null,null,null,0,null,5653.4,null,0,0,0,0,0,1460.27,0,0,0,14514.11]
["0501","ALPENA              ",5596,2928,205348,15180,null,null,null,4028.64,null,23592.76,null,5811.73,11342.57,211723.51999999999,0,0,22960.23,0,17546.03,0,130536.82]
["0502","BERGMAN             ",98530,1830,338402,38375,null,null,null,7609.66,null,59642.23,null,6030.07,21424.86,207986.91,0,0,36170.17,0,15869.19,0,236979.26]
["0503","HARRISON            ",125347,15372,802158,102151,null,null,null,46553.26,null,158762.70000000001,null,41756.339999999997,131069.78,691664.65,0,0,122241.54,0,55479.34,0,692216.55]
["0504","OMAHA               ",101133,732,292672,14496,null,null,null,2685.76,null,22530.27,null,9244.16,7561.71,142137.5,0,0,20828.419999999998,0,11867.45,0,117790.44]
["0505","VALLEY SPRINGS      ",30255,2562,209282,30305,null,null,null,5819.15,null,47099.839999999997,null,7500.91,16383.72,192920.87,0,0,34172.44,0,14685.32,0,211721.86]
["0506","LEAD HILL           ",20693,366,286216,12869,null,null,null,447.62,null,20000.22,null,3632.74,1260.28,168171.74,0,0,23301,0,13491.47,0,120880.06]
["0601","HERMITAGE           ",24776,23790,318496,14661,null,null,null,10295.43,null,22786.71,null,7465.81,28986.58,188783.89,358950.15,0,25585.68,0,14469.39,0,110811.44]
{"$rows_left_out":235}